Target
Carbonic anhydrase 2
Ligand
BDBM50380144
Substrate
Meas. Tech.
ChEMBL_1673894 (CHEMBL4023923)
Kd
51.4±n/a nM
Citation
 Linkuvien?, VTalibov, VODanielson, UHMatulis, D Introduction of Intrinsic Kinetics of Protein-Ligand Interactions and Their Implications for Drug Design. J Med Chem 61:2292-2302 (2018)  
Target
Name:
Carbonic anhydrase 2
Synonyms:
CA-II CAC Carbonate dehydratase II Carbonic anhydrase 2 (CA-II) Carbonic anhydrase C Carbonic anhydrase II (CA-II) Carbonic anhydrase II (hCA II) | Carbonic anhydrase isoenzyme II (hCA II)
Type:
Enzyme
Mol. Mass.:
29250.71
Organism:
Homo sapiens (Human)
Description:
P00918
Residue:
260
  
Inhibitor
Name:
BDBM50380144
Synonyms:
CHEMBL2010994 | carbonic anhydrase (CA) inhibitors, benzenesulphonamide ligand, 8
Type:
Small organic molecule
Emp. Form.:
C16H19N3O4S2
Mol. Mass.:
381.47
SMILES:
CC(C)(C)c1cc(=O)[nH]c(SCC(=O)c2ccc(cc2)S(N)(=O)=O)n1
: