Target
Carbonic anhydrase 13
Ligand
BDBM50163865
Substrate
Meas. Tech.
ChEMBL_1673903 (CHEMBL4023932)
Kd
0.45±n/a nM
Citation
 Linkuvien?, VTalibov, VODanielson, UHMatulis, D Introduction of Intrinsic Kinetics of Protein-Ligand Interactions and Their Implications for Drug Design. J Med Chem 61:2292-2302 (2018)  
Target
Name:
Carbonic anhydrase 13
Synonyms:
CA13 Carbonic anhydrase Carbonic anhydrase XIII (CA XIII)
Type:
Enzyme
Mol. Mass.:
29445.78
Organism:
Homo sapiens (Human)
Description:
Q8N1Q1
Residue:
262
  
Inhibitor
Name:
BDBM50163865
Synonyms:
CHEMBL3799577 | carbonic anhydrase (CA) inhibitors, benzenesulphonamide ligand, 14
Type:
Small organic molecule
Emp. Form.:
C15H15F3N2O4S2
Mol. Mass.:
408.416
SMILES:
CNc1c(F)c(c(F)c(F)c1S(=O)(=O)CCc1ccccc1)S(N)(=O)=O
: