Target
Carbonic anhydrase 9
Ligand
BDBM50163864
Substrate
Meas. Tech.
ChEMBL_1673891 (CHEMBL4023920)
Kd
520±n/a nM
Citation
 Linkuvien?, VTalibov, VODanielson, UHMatulis, D Introduction of Intrinsic Kinetics of Protein-Ligand Interactions and Their Implications for Drug Design. J Med Chem 61:2292-2302 (2018)  
Target
Name:
Carbonic anhydrase 9
Synonyms:
CA-IX CAH9_HUMAN Carbonic anhydrase 9 (CA IX) Carbonic anhydrase 9 precursor Carbonic anhydrase IX (CAIX) Carbonic anhydrases; II & IX MN RCC-associated antigen G250
Type:
Enzyme
Mol. Mass.:
49669.03
Organism:
Homo sapiens (Human)
Description:
Catalytic domain of human cloned isozyme was used in the assay
Residue:
459
  
Inhibitor
Name:
BDBM50163864
Synonyms:
3-(1H-benzimidazol-1-ylacetyl)benzenesulfonamide (3a) carbonic anhydrase (CA) inhibitors, benzenesulphonamide ligand, 3
Type:
Small organic molecule
Emp. Form.:
C15H13N3O3S
Mol. Mass.:
315.347
SMILES:
NS(=O)(=O)c1cccc(c1)C(=O)Cn1cnc2ccccc12
: