Target
Receptor-interacting serine/threonine-protein kinase 1
Ligand
BDBM50244670
Substrate
Meas. Tech.
ChEMBL_1673964 (CHEMBL4023993)
Ki
63±n/a nM
Citation
 Yoshikawa, MSaitoh, MKatoh, TSeki, TBigi, SVShimizu, YIshii, TOkai, TKuno, MHattori, HWatanabe, ESaikatendu, KSZou, HNakakariya, MTatamiya, TNakada, YYogo, T Discovery of 7-Oxo-2,4,5,7-tetrahydro-6 H-pyrazolo[3,4- c]pyridine Derivatives as Potent, Orally Available, and Brain-Penetrating Receptor Interacting Protein 1 (RIP1) Kinase Inhibitors: Analysis of Structure-Kinetic Relationships. J Med Chem 61:2384-2409 (2018)  
Target
Name:
Receptor-interacting serine/threonine-protein kinase 1
Synonyms:
Cell death protein RIP RIP-1 RIPK1 Receptor-interacting protein 1
Type:
Enzyme Catalytic Domain
Mol. Mass.:
75926.99
Organism:
Homo sapiens (Human)
Description:
Q13546
Residue:
671
  
Inhibitor
Name:
BDBM50244670
Synonyms:
CHEMBL4077039
Type:
Small organic molecule
Emp. Form.:
C14H11N3O2
Mol. Mass.:
253.256
SMILES:
[O-][N+](=O)c1ccc2[nH]c(Cc3ccccc3)nc2c1
: