Target
Receptor-interacting serine/threonine-protein kinase 1
Ligand
BDBM50244730
Substrate
Meas. Tech.
ChEMBL_1673964 (CHEMBL4023993)
Ki
0.912011±n/a nM
Citation
 Yoshikawa, MSaitoh, MKatoh, TSeki, TBigi, SVShimizu, YIshii, TOkai, TKuno, MHattori, HWatanabe, ESaikatendu, KSZou, HNakakariya, MTatamiya, TNakada, YYogo, T Discovery of 7-Oxo-2,4,5,7-tetrahydro-6 H-pyrazolo[3,4- c]pyridine Derivatives as Potent, Orally Available, and Brain-Penetrating Receptor Interacting Protein 1 (RIP1) Kinase Inhibitors: Analysis of Structure-Kinetic Relationships. J Med Chem 61:2384-2409 (2018)  
Target
Name:
Receptor-interacting serine/threonine-protein kinase 1
Synonyms:
Cell death protein RIP RIP-1 RIPK1 Receptor-interacting protein 1
Type:
Enzyme Catalytic Domain
Mol. Mass.:
75926.99
Organism:
Homo sapiens (Human)
Description:
Q13546
Residue:
671
  
Inhibitor
Name:
BDBM50244730
Synonyms:
CHEMBL4069537
Type:
Small organic molecule
Emp. Form.:
C25H24ClN5O4
Mol. Mass.:
493.942
SMILES:
CNC(=O)c1ccc2N(C)C(=O)[C@H](COc2c1)N1CCc2c(Cl)n(Cc3ccccc3)nc2C1=O
: