Target
Neutrophil elastase
Ligand
BDBM50004182
Substrate
Meas. Tech.
ChEBML_63655
pH
7.5±n/a
IC50
57.0±n/a nM
Comments
extracted
Citation
 Skiles, JWMiao, CSorcek, RJacober, SMui, PWChow, GWeldon, SMPossanza, GSkoog, MKeirns, J Inhibition of human leukocyte elastase by N-substituted peptides containing alpha,alpha-difluorostatone residues at P1. J Med Chem 35:4795-808 (1993)  
Target
Name:
Neutrophil elastase
Synonyms:
Bone marrow serine protease Coagulation factor X ELANE Elastase HLE Leukocyte elastase Medullasin Neutrophil elastase (HNE) PMN elastase Trypsin
Type:
Enzyme
Mol. Mass.:
28532.38
Organism:
Homo sapiens (Human)
Description:
P08246
Residue:
267
  
Inhibitor
Name:
BDBM50004182
Synonyms:
2-Acetylamino-6-(4-{2-[(2-benzyloxycarbonylamino-3-methyl-butyryl)-indan-2-yl-amino]-acetylamino}-2,2-difluoro-5-methyl-3-oxo-hexanoylamino)-hexanoic acid methyl ester | CHEMBL143049
Type:
Small organic molecule
Emp. Form.:
C40H53F2N5O9
Mol. Mass.:
785.8737
SMILES:
COC(=O)[C@H](CCCCNC(=O)C(F)(F)C(=O)C(NC(=O)CN(C1Cc2ccccc2C1)C(=O)C(NC(=O)OCc1ccccc1)C(C)C)C(C)C)NC(C)=O
: