Target
Carbonic anhydrase 9
Ligand
BDBM50245747
Substrate
Meas. Tech.
ChEBML_1675880
Ki
76±n/a nM
Citation
 Bozdag, MAlafeefy, AMAltamimi, AMCarta, FSupuran, CTVullo, D Synthesis of new 3-(2-mercapto-4-oxo-4H-quinazolin-3-yl)-benzenesulfonamides with strong inhibition properties against the tumor associated carbonic anhydrases IX and XII. Bioorg Med Chem 25:2782-2788 (2017)  
Target
Name:
Carbonic anhydrase 9
Synonyms:
CA-IX CAH9_HUMAN Carbonic anhydrase 9 (CA IX) Carbonic anhydrase 9 precursor Carbonic anhydrase IX (CAIX) Carbonic anhydrases; II & IX MN RCC-associated antigen G250
Type:
Enzyme
Mol. Mass.:
49669.03
Organism:
Homo sapiens (Human)
Description:
Catalytic domain of human cloned isozyme was used in the assay
Residue:
459
  
Inhibitor
Name:
BDBM50245747
Synonyms:
CHEMBL4068913
Type:
Small organic molecule
Emp. Form.:
C14H11N3O3S2
Mol. Mass.:
333.385
SMILES:
NS(=O)(=O)c1cccc(c1)-n1c(S)nc2ccccc2c1=O
: