Target
Carbonic anhydrase 2
Ligand
BDBM50245752
Substrate
Meas. Tech.
ChEBML_1675879
Ki
28±n/a nM
Citation
 Bozdag, MAlafeefy, AMAltamimi, AMCarta, FSupuran, CTVullo, D Synthesis of new 3-(2-mercapto-4-oxo-4H-quinazolin-3-yl)-benzenesulfonamides with strong inhibition properties against the tumor associated carbonic anhydrases IX and XII. Bioorg Med Chem 25:2782-2788 (2017)  
Target
Name:
Carbonic anhydrase 2
Synonyms:
CA-II CAC Carbonate dehydratase II Carbonic anhydrase 2 (CA-II) Carbonic anhydrase C Carbonic anhydrase II (CA-II) Carbonic anhydrase II (hCA II) | Carbonic anhydrase isoenzyme II (hCA II)
Type:
Enzyme
Mol. Mass.:
29250.71
Organism:
Homo sapiens (Human)
Description:
P00918
Residue:
260
  
Inhibitor
Name:
BDBM50245752
Synonyms:
CHEMBL4098958
Type:
Small organic molecule
Emp. Form.:
C14H10IN3O3S2
Mol. Mass.:
459.282
SMILES:
NS(=O)(=O)c1cccc(c1)-n1c(S)nc2ccc(I)cc2c1=O
: