Target
Carbonic anhydrase 9
Ligand
BDBM50245819
Substrate
Meas. Tech.
ChEBML_1675880
Ki
13±n/a nM
Citation
 Bozdag, MAlafeefy, AMAltamimi, AMCarta, FSupuran, CTVullo, D Synthesis of new 3-(2-mercapto-4-oxo-4H-quinazolin-3-yl)-benzenesulfonamides with strong inhibition properties against the tumor associated carbonic anhydrases IX and XII. Bioorg Med Chem 25:2782-2788 (2017)  
Target
Name:
Carbonic anhydrase 9
Synonyms:
CA-IX CAH9_HUMAN Carbonic anhydrase 9 (CA IX) Carbonic anhydrase 9 precursor Carbonic anhydrase IX (CAIX) Carbonic anhydrases; II & IX MN RCC-associated antigen G250
Type:
Enzyme
Mol. Mass.:
49669.03
Organism:
Homo sapiens (Human)
Description:
Catalytic domain of human cloned isozyme was used in the assay
Residue:
459
  
Inhibitor
Name:
BDBM50245819
Synonyms:
CHEMBL4059504
Type:
Small organic molecule
Emp. Form.:
C15H13N3O4S2
Mol. Mass.:
363.411
SMILES:
COc1ccc2nc(S)n(-c3cccc(c3)S(N)(=O)=O)c(=O)c2c1
: