Target
Carbonic anhydrase 12
Ligand
BDBM50245805
Substrate
Meas. Tech.
ChEBML_1675881
Ki
4.7±n/a nM
Citation
 Bozdag, MAlafeefy, AMAltamimi, AMCarta, FSupuran, CTVullo, D Synthesis of new 3-(2-mercapto-4-oxo-4H-quinazolin-3-yl)-benzenesulfonamides with strong inhibition properties against the tumor associated carbonic anhydrases IX and XII. Bioorg Med Chem 25:2782-2788 (2017)  
Target
Name:
Carbonic anhydrase 12
Synonyms:
CA-XII CAH12_HUMAN Carbonic anhydrase Carbonic anhydrase XII Carbonic anhydrase XII (CAXII) | Tumor antigen HOM-RCC-3.1.3
Type:
Enzyme
Mol. Mass.:
39456.00
Organism:
Homo sapiens (Human)
Description:
Catalytic domain of human cloned isozyme was used in the assay
Residue:
354
  
Inhibitor
Name:
BDBM50245805
Synonyms:
CHEMBL4071020
Type:
Small organic molecule
Emp. Form.:
C16H15N3O5S2
Mol. Mass.:
393.437
SMILES:
COc1cc2nc(S)n(-c3cccc(c3)S(N)(=O)=O)c(=O)c2cc1OC
: