Target
Acyl-CoA (8-3)-desaturase
Ligand
BDBM50246049
Substrate
Meas. Tech.
ChEMBL_1676417 (CHEMBL4026560)
IC50
3.7±n/a nM
Citation
 Fujimoto, JOkamoto, RNoguchi, NHara, RMasada, SKawamoto, TNagase, HTamura, YOImanishi, MTakagahara, SKubo, KTohyama, KIida, KAndou, TMiyahisa, IMatsui, JHayashi, RMaekawa, TMatsunaga, N Discovery of 3,5-Diphenyl-4-methyl-1,3-oxazolidin-2-ones as Novel, Potent, and Orally Available?-5 Desaturase (D5D) Inhibitors. J Med Chem 60:8963-8981 (2017)  
Target
Name:
Acyl-CoA (8-3)-desaturase
Synonyms:
FADS1 FADSD5 | Fatty acid desaturase 1
Type:
PROTEIN
Mol. Mass.:
51985.80
Organism:
Homo sapiens (Human)
Description:
ChEMBL_1513296
Residue:
444
  
Inhibitor
Name:
BDBM50246049
Synonyms:
CHEMBL4102458
Type:
Small organic molecule
Emp. Form.:
C17H12F2N2O2
Mol. Mass.:
314.2862
SMILES:
C[C@H]1[C@@H](OC(=O)N1c1cc(F)cc(c1)C#N)c1ccc(F)cc1
: