Target
ATP-binding cassette sub-family C member 2
Ligand
BDBM50131270
Substrate
Meas. Tech.
ChEMBL_1678645 (CHEMBL4028922)
IC50
>133000±n/a nM
Citation
 Morgan, REvan Staden, CJChen, YKalyanaraman, NKalanzi, JDunn, RTAfshari, CAHamadeh, HK A multifactorial approach to hepatobiliary transporter assessment enables improved therapeutic compound development. Toxicol Sci 136:216-41 (2013)  
Target
Name:
ATP-binding cassette sub-family C member 2
Synonyms:
ABCC2 CMOAT CMRP Canalicular multispecific organic anion transporter 1 MRP2 Multidrug resistance-associated protein 2 Multidrug resistance-associated protein 3 (MRP3)
Type:
Protein
Mol. Mass.:
174229.45
Organism:
Homo sapiens (Human)
Description:
Q92887
Residue:
1545
  
Inhibitor
Name:
BDBM50131270
Synonyms:
2-methyl-N-[4-nitro-3-(trifluoromethyl)phenyl]propanamide CHEMBL806 FLUTAMIDE alpha,alpha,alpha-trifluoro-2-methyl-4'-nitro-m-propionotoluidide | niftolid
Type:
Small organic molecule
Emp. Form.:
C11H11F3N2O3
Mol. Mass.:
276.2118
SMILES:
CC(C)C(=O)Nc1ccc(c(c1)C(F)(F)F)[N+]([O-])=O
: