Target
Bile salt export pump
Ligand
BDBM50248008
Substrate
Meas. Tech.
ChEMBL_1678644 (CHEMBL4028921)
IC50
>133000±n/a nM
Citation
 Morgan, REvan Staden, CJChen, YKalyanaraman, NKalanzi, JDunn, RTAfshari, CAHamadeh, HK A multifactorial approach to hepatobiliary transporter assessment enables improved therapeutic compound development. Toxicol Sci 136:216-41 (2013)  
Target
Name:
Bile salt export pump
Synonyms:
ABCB11 ATP-binding cassette sub-family B member 11 Bile Salt Export Pump, BSEP Bile salt export pump (BSEP)
Type:
Protein
Mol. Mass.:
146405.49
Organism:
Homo sapiens (Human)
Description:
O95342
Residue:
1321
  
Inhibitor
Name:
BDBM50248008
Synonyms:
BMS-200475-01 CHEBI:473990 SQ-34676
Type:
Small organic molecule
Emp. Form.:
C12H15N5O3
Mol. Mass.:
277.2792
SMILES:
Nc1nc2n(cnc2c(=O)[nH]1)[C@H]1C[C@H](O)[C@@H](CO)C1=C
: