Target
ATP-binding cassette sub-family C member 4
Ligand
BDBM50247975
Substrate
Meas. Tech.
ChEMBL_1678647 (CHEMBL4028924)
IC50
>133000±n/a nM
Citation
 Morgan, REvan Staden, CJChen, YKalyanaraman, NKalanzi, JDunn, RTAfshari, CAHamadeh, HK A multifactorial approach to hepatobiliary transporter assessment enables improved therapeutic compound development. Toxicol Sci 136:216-41 (2013)  
Target
Name:
ATP-binding cassette sub-family C member 4
Synonyms:
ABCC4 MOAT-B MRP/cMOAT-related ABC transporter MRP4_HUMAN Multidrug resistance-associated protein 4
Type:
PROTEIN
Mol. Mass.:
149546.12
Organism:
Homo sapiens (Human)
Description:
ChEMBL_1486828
Residue:
1325
  
Inhibitor
Name:
BDBM50247975
Synonyms:
Ercoquin Oxichlorochine Plaquenil Quinoric | TCMDC-123987
Type:
Small organic molecule
Emp. Form.:
C18H28ClN3O5S
Mol. Mass.:
433.95
SMILES:
OS(O)(=O)=O.CCN(CCO)CCCC(C)Nc1ccnc2cc(Cl)ccc12
: