Target
Bile salt export pump
Ligand
BDBM86731
Substrate
Meas. Tech.
ChEMBL_1678644 (CHEMBL4028921)
IC50
45000±n/a nM
Citation
 Morgan, REvan Staden, CJChen, YKalyanaraman, NKalanzi, JDunn, RTAfshari, CAHamadeh, HK A multifactorial approach to hepatobiliary transporter assessment enables improved therapeutic compound development. Toxicol Sci 136:216-41 (2013)  
Target
Name:
Bile salt export pump
Synonyms:
ABCB11 ATP-binding cassette sub-family B member 11 Bile Salt Export Pump, BSEP Bile salt export pump (BSEP)
Type:
Protein
Mol. Mass.:
146405.49
Organism:
Homo sapiens (Human)
Description:
O95342
Residue:
1321
  
Inhibitor
Name:
BDBM86731
Synonyms:
CAS_74191-85-8 UK 33,274
Type:
Small organic molecule
Emp. Form.:
C23H25N5O5
Mol. Mass.:
451.4751
SMILES:
COc1cc2nc(nc(N)c2cc1OC)N1CCN(CC1)C(=O)C1COc2ccccc2O1
: