Target
ATP-binding cassette sub-family C member 3
Ligand
BDBM50448407
Substrate
Meas. Tech.
ChEMBL_1678646 (CHEMBL4028923)
IC50
88200±n/a nM
Citation
 Morgan, REvan Staden, CJChen, YKalyanaraman, NKalanzi, JDunn, RTAfshari, CAHamadeh, HK A multifactorial approach to hepatobiliary transporter assessment enables improved therapeutic compound development. Toxicol Sci 136:216-41 (2013)  
Target
Name:
ATP-binding cassette sub-family C member 3
Synonyms:
ABCC3 CMOAT2 MLP2 MRP3 Multi-specific organic anion transporter D | Multidrug resistance-associated protein 3
Type:
PROTEIN
Mol. Mass.:
169352.45
Organism:
Homo sapiens (Human)
Description:
ChEMBL_735421
Residue:
1527
  
Inhibitor
Name:
BDBM50448407
Synonyms:
CHEBI:4877 | Ethambutol
Type:
Small organic molecule
Emp. Form.:
C10H24N2O2
Mol. Mass.:
204.3098
SMILES:
CC[C@@H](CO)NCCN[C@@H](CC)CO
: