Target
ATP-binding cassette sub-family C member 3
Ligand
BDBM50101853
Substrate
Meas. Tech.
ChEMBL_1678646 (CHEMBL4028923)
IC50
26900±n/a nM
Citation
 Morgan, REvan Staden, CJChen, YKalyanaraman, NKalanzi, JDunn, RTAfshari, CAHamadeh, HK A multifactorial approach to hepatobiliary transporter assessment enables improved therapeutic compound development. Toxicol Sci 136:216-41 (2013)  
Target
Name:
ATP-binding cassette sub-family C member 3
Synonyms:
ABCC3 CMOAT2 MLP2 MRP3 Multi-specific organic anion transporter D | Multidrug resistance-associated protein 3
Type:
PROTEIN
Mol. Mass.:
169352.45
Organism:
Homo sapiens (Human)
Description:
ChEMBL_735421
Residue:
1527
  
Inhibitor
Name:
BDBM50101853
Synonyms:
(11alpha,13E,15S)-11,15-dihydroxy-9-oxoprost-13-en-1-oic acid 11alpha,15alpha-dihydroxy-9-oxo-13-trans-prostenoic acid CHEMBL495 PGE1 | prostaglandin E1
Type:
Small organic molecule
Emp. Form.:
C20H34O5
Mol. Mass.:
354.481
SMILES:
CCCCC[C@H](O)\C=C\[C@H]1[C@H](O)CC(=O)[C@@H]1CCCCCCC(O)=O
: