Target
ATP-binding cassette sub-family C member 3
Ligand
BDBM50097346
Substrate
Meas. Tech.
ChEMBL_1678646 (CHEMBL4028923)
IC50
>133000±n/a nM
Citation
 Morgan, REvan Staden, CJChen, YKalyanaraman, NKalanzi, JDunn, RTAfshari, CAHamadeh, HK A multifactorial approach to hepatobiliary transporter assessment enables improved therapeutic compound development. Toxicol Sci 136:216-41 (2013)  
Target
Name:
ATP-binding cassette sub-family C member 3
Synonyms:
ABCC3 CMOAT2 MLP2 MRP3 Multi-specific organic anion transporter D | Multidrug resistance-associated protein 3
Type:
PROTEIN
Mol. Mass.:
169352.45
Organism:
Homo sapiens (Human)
Description:
ChEMBL_735421
Residue:
1527
  
Inhibitor
Name:
BDBM50097346
Synonyms:
(+/-)-2-(3-chloro-9H-carbazol-7-yl)propanoic acid 2-(6-Chloro-9H-carbazol-2-yl)-propionic acid(carprofen) CARPROFEN Rimadyl | Ro-20-5720/000
Type:
Small organic molecule
Emp. Form.:
C15H12ClNO2
Mol. Mass.:
273.714
SMILES:
CC(C(O)=O)c1ccc2c(c1)[nH]c1ccc(Cl)cc21
: