Target
Bile salt export pump
Ligand
BDBM50350464
Substrate
Meas. Tech.
ChEMBL_1678644 (CHEMBL4028921)
IC50
>133000±n/a nM
Citation
 Morgan, REvan Staden, CJChen, YKalyanaraman, NKalanzi, JDunn, RTAfshari, CAHamadeh, HK A multifactorial approach to hepatobiliary transporter assessment enables improved therapeutic compound development. Toxicol Sci 136:216-41 (2013)  
Target
Name:
Bile salt export pump
Synonyms:
ABCB11 ATP-binding cassette sub-family B member 11 Bile Salt Export Pump, BSEP Bile salt export pump (BSEP)
Type:
Protein
Mol. Mass.:
146405.49
Organism:
Homo sapiens (Human)
Description:
O95342
Residue:
1321
  
Inhibitor
Name:
BDBM50350464
Synonyms:
AMOXICILLINE Amoxi-Tabs | Amoxicillin
Type:
Small organic molecule
Emp. Form.:
C16H19N3O5S
Mol. Mass.:
365.404
SMILES:
CC1(C)S[C@@H]2[C@H](NC(=O)[C@H](N)c3ccc(O)cc3)C(=O)N2[C@H]1C(O)=O
: