Target
ATP-binding cassette sub-family C member 3
Ligand
BDBM50237609
Substrate
Meas. Tech.
ChEMBL_1678646 (CHEMBL4028923)
IC50
>133000±n/a nM
Citation
 Morgan, REvan Staden, CJChen, YKalyanaraman, NKalanzi, JDunn, RTAfshari, CAHamadeh, HK A multifactorial approach to hepatobiliary transporter assessment enables improved therapeutic compound development. Toxicol Sci 136:216-41 (2013)  
Target
Name:
ATP-binding cassette sub-family C member 3
Synonyms:
ABCC3 CMOAT2 MLP2 MRP3 Multi-specific organic anion transporter D | Multidrug resistance-associated protein 3
Type:
PROTEIN
Mol. Mass.:
169352.45
Organism:
Homo sapiens (Human)
Description:
ChEMBL_735421
Residue:
1527
  
Inhibitor
Name:
BDBM50237609
Synonyms:
CHEBI:6900 Metocurine
Type:
Small organic molecule
Emp. Form.:
C40H48N2O6
Mol. Mass.:
652.8178
SMILES:
[H][C@]12Cc3ccc(Oc4c(OC)c(OC)cc5CC[N+](C)(C)[C@]([H])(Cc6ccc(OC)c(Oc7cc1c(CC[N+]2(C)C)cc7OC)c6)c45)cc3
: