Target
ATP-binding cassette sub-family C member 3
Ligand
BDBM50213021
Substrate
Meas. Tech.
ChEMBL_1678646 (CHEMBL4028923)
IC50
42000±n/a nM
Citation
 Morgan, REvan Staden, CJChen, YKalyanaraman, NKalanzi, JDunn, RTAfshari, CAHamadeh, HK A multifactorial approach to hepatobiliary transporter assessment enables improved therapeutic compound development. Toxicol Sci 136:216-41 (2013)  
Target
Name:
ATP-binding cassette sub-family C member 3
Synonyms:
ABCC3 CMOAT2 MLP2 MRP3 Multi-specific organic anion transporter D | Multidrug resistance-associated protein 3
Type:
PROTEIN
Mol. Mass.:
169352.45
Organism:
Homo sapiens (Human)
Description:
ChEMBL_735421
Residue:
1527
  
Inhibitor
Name:
BDBM50213021
Synonyms:
CHEBI:63621 Invirase Ro-318959000 US10806794, Compound Saquinavir
Type:
Small organic molecule
Emp. Form.:
C38H50N6O5
Mol. Mass.:
670.8408
SMILES:
[H][C@@]12CCCC[C@]1([H])CN(C[C@@H](O)[C@H](Cc1ccccc1)NC(=O)[C@H](CC(N)=O)NC(=O)c1ccc3ccccc3n1)[C@@H](C2)C(=O)NC(C)(C)C
: