Target
Muscarinic acetylcholine receptor M4
Ligand
BDBM50249404
Substrate
Meas. Tech.
ChEMBL_1679899 (CHEMBL4030176)
EC50
1540±n/a nM
Citation
 Melancon, BJWood, MRNoetzel, MJNance, KDEngelberg, EMHan, CLamsal, AChang, SCho, HPByers, FWBubser, MJones, CKNiswender, CMWood, MWEngers, DWWu, DBrandon, NJDuggan, MEConn, PJBridges, TMLindsley, CW Optimization of M Bioorg Med Chem Lett 27:2296-2301 (2017)  
Target
Name:
Muscarinic acetylcholine receptor M4
Synonyms:
ACM4_HUMAN Cholinergic, muscarinic M4 Muscarinic acetylcholine receptor M2 and M4
Type:
Enzyme Catalytic Domain
Mol. Mass.:
53079.31
Organism:
Homo sapiens (Human)
Description:
Cholinergic, muscarinic M4 CHRM4 HUMAN M3::P08173
Residue:
479
  
Inhibitor
Name:
BDBM50249404
Synonyms:
CHEMBL4066953
Type:
Small organic molecule
Emp. Form.:
C21H18FN5OS
Mol. Mass.:
407.464
SMILES:
Cc1nnc2sc(C(=O)NCc3ccc(cc3)-c3ccncc3F)c(N)c2c1C
: