Target
Muscarinic acetylcholine receptor M4
Ligand
BDBM50249403
Substrate
Meas. Tech.
ChEBML_1679911
EC50
11.7±n/a nM
Citation
 Melancon, BJWood, MRNoetzel, MJNance, KDEngelberg, EMHan, CLamsal, AChang, SCho, HPByers, FWBubser, MJones, CKNiswender, CMWood, MWEngers, DWWu, DBrandon, NJDuggan, MEConn, PJBridges, TMLindsley, CW Optimization of M Bioorg Med Chem Lett 27:2296-2301 (2017)  
Target
Name:
Muscarinic acetylcholine receptor M4
Synonyms:
ACM4_RAT Chrm-4 | Chrm4
Type:
Enzyme Catalytic Domain
Mol. Mass.:
52841.70
Organism:
RAT
Description:
Cholinergic, muscarinic M4 CHRM4 RAT::P08485
Residue:
477
  
Inhibitor
Name:
BDBM50249403
Synonyms:
CHEMBL4091821
Type:
Small organic molecule
Emp. Form.:
C21H18FN5OS
Mol. Mass.:
407.464
SMILES:
Cc1nnc2sc(C(=O)NCc3ccc(cc3)-c3cccnc3F)c(N)c2c1C
: