Target
Cytochrome P450 2D6
Ligand
BDBM50249405
Substrate
Meas. Tech.
ChEBML_1679903
IC50
>30000±n/a nM
Citation
 Melancon, BJWood, MRNoetzel, MJNance, KDEngelberg, EMHan, CLamsal, AChang, SCho, HPByers, FWBubser, MJones, CKNiswender, CMWood, MWEngers, DWWu, DBrandon, NJDuggan, MEConn, PJBridges, TMLindsley, CW Optimization of M Bioorg Med Chem Lett 27:2296-2301 (2017)  
Target
Name:
Cytochrome P450 2D6
Synonyms:
CP2D6_HUMAN CYP2DL1 Cytochrome P450 2D6 (CYP2D6) P450-DB1
Type:
Protein
Mol. Mass.:
55774.82
Organism:
Homo sapiens (Human)
Description:
P10635
Residue:
497
  
Inhibitor
Name:
BDBM50249405
Synonyms:
CHEMBL4102040
Type:
Small organic molecule
Emp. Form.:
C21H18FN5OS
Mol. Mass.:
407.464
SMILES:
Cc1nnc2sc(C(=O)NCc3ccc(cc3)-c3ccc(F)nc3)c(N)c2c1C
: