Target
Muscarinic acetylcholine receptor M4
Ligand
BDBM50249440
Substrate
Meas. Tech.
ChEBML_1679899
EC50
1650±n/a nM
Citation
 Melancon, BJWood, MRNoetzel, MJNance, KDEngelberg, EMHan, CLamsal, AChang, SCho, HPByers, FWBubser, MJones, CKNiswender, CMWood, MWEngers, DWWu, DBrandon, NJDuggan, MEConn, PJBridges, TMLindsley, CW Optimization of M Bioorg Med Chem Lett 27:2296-2301 (2017)  
Target
Name:
Muscarinic acetylcholine receptor M4
Synonyms:
ACM4_HUMAN Cholinergic, muscarinic M4 Muscarinic acetylcholine receptor M2 and M4
Type:
Enzyme Catalytic Domain
Mol. Mass.:
53079.31
Organism:
Homo sapiens (Human)
Description:
Cholinergic, muscarinic M4 CHRM4 HUMAN M3::P08173
Residue:
479
  
Inhibitor
Name:
BDBM50249440
Synonyms:
CHEMBL4069641
Type:
Small organic molecule
Emp. Form.:
C22H20N4OS
Mol. Mass.:
388.485
SMILES:
Cc1nnc2sc(C(=O)NCc3cccc(c3)-c3ccccc3)c(N)c2c1C
: