Target
Sodium-dependent dopamine transporter
Ligand
BDBM50250548
Substrate
Meas. Tech.
ChEBML_1681846
IC50
40400±n/a nM
Citation
 Kalaba, PAher, NYIli?, MDraga?evi?, VWieder, MMiklosi, AGZehl, MWackerlig, JRoller, ABeryozkina, TRadoman, BSaroja, SRLindner, WGonzalez, EPBakulev, VLeban, JJSitte, HHUrban, ELanger, TLubec, G Heterocyclic Analogues of Modafinil as Novel, Atypical Dopamine Transporter Inhibitors. J Med Chem 60:9330-9348 (2017)  
Target
Name:
Sodium-dependent dopamine transporter
Synonyms:
DA transporter DAT1 Dopamine transporter protein (DAT) SC6A3_HUMAN Sodium-dependent dopamine transporter Solute carrier family 6 member 3
Type:
Multi-pass membrane protein
Mol. Mass.:
68497.11
Organism:
Homo sapiens (Human)
Description:
Q01959
Residue:
620
  
Inhibitor
Name:
BDBM50250548
Synonyms:
CHEMBL4070266
Type:
Small organic molecule
Emp. Form.:
C19H15F3N2O2S
Mol. Mass.:
392.395
SMILES:
Oc1cc(nc(C[S+]([O-])C(c2ccccc2)c2ccccc2)n1)C(F)(F)F
: