Target
Sodium-dependent dopamine transporter
Ligand
BDBM50250542
Substrate
Meas. Tech.
ChEBML_1681846
IC50
2000±n/a nM
Citation
 Kalaba, PAher, NYIli?, MDraga?evi?, VWieder, MMiklosi, AGZehl, MWackerlig, JRoller, ABeryozkina, TRadoman, BSaroja, SRLindner, WGonzalez, EPBakulev, VLeban, JJSitte, HHUrban, ELanger, TLubec, G Heterocyclic Analogues of Modafinil as Novel, Atypical Dopamine Transporter Inhibitors. J Med Chem 60:9330-9348 (2017)  
Target
Name:
Sodium-dependent dopamine transporter
Synonyms:
DA transporter DAT1 Dopamine transporter protein (DAT) SC6A3_HUMAN Sodium-dependent dopamine transporter Solute carrier family 6 member 3
Type:
Multi-pass membrane protein
Mol. Mass.:
68497.11
Organism:
Homo sapiens (Human)
Description:
Q01959
Residue:
620
  
Inhibitor
Name:
BDBM50250542
Synonyms:
CHEMBL4064788
Type:
Small organic molecule
Emp. Form.:
C19H18OS2
Mol. Mass.:
326.476
SMILES:
Cc1ccc(cc1)C([S+]([O-])Cc1cccs1)c1ccccc1
: