Target
Sodium-dependent dopamine transporter
Ligand
BDBM50250558
Substrate
Meas. Tech.
ChEMBL_1681846 (CHEMBL4032123)
IC50
3700±n/a nM
Citation
 Kalaba, PAher, NYIli?, MDraga?evi?, VWieder, MMiklosi, AGZehl, MWackerlig, JRoller, ABeryozkina, TRadoman, BSaroja, SRLindner, WGonzalez, EPBakulev, VLeban, JJSitte, HHUrban, ELanger, TLubec, G Heterocyclic Analogues of Modafinil as Novel, Atypical Dopamine Transporter Inhibitors. J Med Chem 60:9330-9348 (2017)  
Target
Name:
Sodium-dependent dopamine transporter
Synonyms:
DA transporter DAT1 Dopamine transporter protein (DAT) SC6A3_HUMAN Sodium-dependent dopamine transporter Solute carrier family 6 member 3
Type:
Multi-pass membrane protein
Mol. Mass.:
68497.11
Organism:
Homo sapiens (Human)
Description:
Q01959
Residue:
620
  
Inhibitor
Name:
BDBM50250558
Synonyms:
CHEMBL4074404
Type:
Small organic molecule
Emp. Form.:
C18H15BrOS2
Mol. Mass.:
391.345
SMILES:
[O-][S+](Cc1cccs1)C(c1ccccc1)c1ccc(Br)cc1
: