Target
Tyrosine-protein phosphatase non-receptor type 5
Ligand
BDBM50250602
Substrate
Meas. Tech.
ChEBML_1681976
Ki
3000±n/a nM
Citation
 Witten, MRWissler, LSnow, MGeschwindner, SRead, JABrandon, NJNairn, ACLombroso, PJKäck, HEllman, JA X-ray Characterization and Structure-Based Optimization of Striatal-Enriched Protein Tyrosine Phosphatase Inhibitors. J Med Chem 60:9299-9319 (2017)  
Target
Name:
Tyrosine-protein phosphatase non-receptor type 5
Synonyms:
PTN5_HUMAN Tyrosine-protein phosphatase non-receptor type 5 | Tyrosine-protein phosphatase non-receptor type 5 isoform a
Type:
Enzyme Catalytic Domain
Mol. Mass.:
63510.68
Organism:
Homo sapiens (Human)
Description:
gi_90652859
Residue:
565
  
Inhibitor
Name:
BDBM50250602
Synonyms:
CHEMBL4087599
Type:
Small organic molecule
Emp. Form.:
C26H23Cl3F2NO4P
Mol. Mass.:
588.795
SMILES:
OP(O)(=O)C(F)(C(=O)N1CCCCC1)c1ccc(cc1)-c1cccc(Cc2cc(Cl)c(Cl)cc2Cl)c1F
: