Target
Receptor-type tyrosine-protein phosphatase F
Ligand
BDBM50250606
Substrate
Meas. Tech.
ChEBML_1681981
Ki
1600±n/a nM
Citation
 Witten, MRWissler, LSnow, MGeschwindner, SRead, JABrandon, NJNairn, ACLombroso, PJKäck, HEllman, JA X-ray Characterization and Structure-Based Optimization of Striatal-Enriched Protein Tyrosine Phosphatase Inhibitors. J Med Chem 60:9299-9319 (2017)  
Target
Name:
Receptor-type tyrosine-protein phosphatase F
Synonyms:
LAR Leukocyte common antigen related (LAR) PTPRF_HUMAN Receptor-type tyrosine-protein phosphatase F (LAR)
Type:
Protein
Mol. Mass.:
212869.85
Organism:
Homo sapiens (Human)
Description:
P10586
Residue:
1907
  
Inhibitor
Name:
BDBM50250606
Synonyms:
CHEMBL4077342
Type:
Small organic molecule
Emp. Form.:
C24H21Cl3F2NO6PS
Mol. Mass.:
626.821
SMILES:
OP(O)(=O)C(F)(c1ccc(cc1)-c1cccc(Cc2cc(Cl)c(Cl)cc2Cl)c1F)S(=O)(=O)N1CCOCC1
: