Target
C-X-C chemokine receptor type 4
Ligand
BDBM50192468
Substrate
Meas. Tech.
ChEMBL_1682129 (CHEMBL4032406)
IC50
338±n/a nM
Citation
 Di Maro, SDi Leva, FSTrotta, AMBrancaccio, DPortella, LAurilio, MTomassi, SMessere, ASementa, DLastoria, SCarotenuto, ANovellino, EScala, SMarinelli, L Structure-Activity Relationships and Biological Characterization of a Novel, Potent, and Serum Stable C-X-C Chemokine Receptor Type 4 (CXCR4) Antagonist. J Med Chem 60:9641-9652 (2017)  
Target
Name:
C-X-C chemokine receptor type 4
Synonyms:
C-X-C chemokine receptor type 4 CD_antigen=CD184 CXCR-4 CXCR4_HUMAN Fusin LCR1 Leukocyte-derived seven transmembrane domain receptor SDF-1 receptor | Stromal cell-derived factor 1 receptor
Type:
Enzyme
Mol. Mass.:
39754.61
Organism:
Homo sapiens (Human)
Description:
P61073
Residue:
352
  
Inhibitor
Name:
BDBM50192468
Synonyms:
CHEMBL3923282
Type:
Small organic molecule
Emp. Form.:
C41H59N13O9S2
Mol. Mass.:
942.119
SMILES:
C[C@H](NC(=O)[C@H](CCCNC(N)=N)NC(C)=O)C(=O)N[C@@H]1CSSC[C@H](NC(=O)[C@H](Cc2ccccc2)NC(=O)[C@H](Cc2ccccc2)NC(=O)[C@H](CCCNC(N)=N)NC1=O)C(O)=O
: