Target
Delta-type opioid receptor
Ligand
BDBM50254124
Substrate
Meas. Tech.
ChEMBL_1686078 (CHEMBL4036557)
EC50
0.230000±n/a nM
Citation
 Watanabe, YHayashida, KSaito, DTakahashi, TSakai, JNakata, EKanda, TIwai, THirayama, SFujii, HYamakawa, TNagase, H Design and synthesis of novel? opioid receptor agonists with an azatricyclodecane skeleton for improving blood-brain barrier penetration. Bioorg Med Chem Lett 27:3495-3498 (2017)  
Target
Name:
Delta-type opioid receptor
Synonyms:
D-OR-1 Delta opioid receptor OPIATE Delta OPRD1 OPRK1 | opioid receptor, delta 1
Type:
G Protein-Coupled Receptor (GPCR)
Mol. Mass.:
40382.98
Organism:
Homo sapiens (Human)
Description:
Competition binding assays were carried out using membrane preparations from transfected HN9.10 cells that constitutively expressed the delta opioid receptor.
Residue:
372
  
Inhibitor
Name:
BDBM50254124
Synonyms:
CHEMBL4103044
Type:
Small organic molecule
Emp. Form.:
C28H32N2O3
Mol. Mass.:
444.5653
SMILES:
[H][C@]12CN(C3CCC4(C1)C1Cc5ccc(O)cc5C4(CCN1CC1CC1)C23)C(=O)c1ccoc1
: