Target
Cytochrome P450 1A2
Ligand
BDBM50442525
Substrate
Meas. Tech.
ChEBML_1688651
IC50
<100±n/a nM
Citation
 Felts, ASRodriguez, ALBlobaum, ALMorrison, RDBates, BSThompson Gray, ARook, JMTantawy, MNByers, FWChang, SVenable, DFLuscombe, VBTamagnan, GDNiswender, CMDaniels, JSJones, CKConn, PJLindsley, CWEmmitte, KA Discovery of N-(5-Fluoropyridin-2-yl)-6-methyl-4-(pyrimidin-5-yloxy)picolinamide (VU0424238): A Novel Negative Allosteric Modulator of Metabotropic Glutamate Receptor Subtype 5 Selected for Clinical Evaluation. J Med Chem 60:5072-5085 (2017)  
Target
Name:
Cytochrome P450 1A2
Synonyms:
CP1A2_HUMAN CYPIA2 Cytochrome P(3)450 Cytochrome P450 1A2 (CYP1A2) Cytochrome P450-P3
Type:
Enzyme
Mol. Mass.:
58423.38
Organism:
Homo sapiens (Human)
Description:
P05177
Residue:
516
  
Inhibitor
Name:
BDBM50442525
Synonyms:
CHEMBL2440659 | US8796295, Table 2: Compound: 1
Type:
Small organic molecule
Emp. Form.:
C15H11FN4O2S
Mol. Mass.:
330.337
SMILES:
Cc1csc(NC(=O)c2cc(F)cc(Oc3cncnc3)c2)n1
: