Target
Apelin receptor
Ligand
BDBM50257252
Substrate
Meas. Tech.
ChEBML_1689663
Ki
0.150000±n/a nM
Citation
 McKinnie, SMKWang, WFischer, CMcDonald, TKalin, KRIturrioz, XLlorens-Cortes, COudit, GYVederas, JC Synthetic Modification within the"RPRL" Region of Apelin Peptides: Impact on Cardiovascular Activity and Stability to Neprilysin and Plasma Degradation. J Med Chem 60:6408-6427 (2017)  
Target
Name:
Apelin receptor
Synonyms:
APJ_RAT Angiotensin receptor-like 1 Apj B78 GPCR34
Type:
PROTEIN
Mol. Mass.:
42351.61
Organism:
Rattus norvegicus
Description:
ChEMBL_10710
Residue:
377
  
Inhibitor
Name:
BDBM50257252
Synonyms:
CHEMBL4076953
Type:
Small organic molecule
Emp. Form.:
C95H156BrN35O20
Mol. Mass.:
2188.382
SMILES:
CCCC[C@H](NC(=O)[C@@H]1CCCN1C(=O)CNC(=O)[C@H](CCCCN)NC(=O)[C@H](Cc1c[nH]cn1)NC(=O)[C@H](CO)NC(=O)N(CC(C)C)NC(=O)[C@H](CCCNC(N)=N)NC(=O)[C@@H]1CCCN1C(=O)[C@H](CCCNC(N)=N)NC(=O)[C@H](CCC(N)=O)NC(=O)[C@H](CCCNC(N)=N)NC(=O)[C@H](CCCNC(N)=N)NC(=O)[C@H](Cc1ccccc1)NC(=O)[C@@H](N)CCCCN)C(=O)NC(C)(C)C(=O)N[C@@H](Cc1ccc(Br)cc1)C(O)=O
: