Target
Metabotropic glutamate receptor 2
Ligand
BDBM50257593
Substrate
Meas. Tech.
ChEMBL_1689940 (CHEMBL4040510)
Ki
3.9±n/a nM
Citation
 Doornbos, MLJCid, JMHaubrich, JNunes, Avan de Sande, JWVermond, SCMulder-Krieger, TTrabanco, AAAhnaou, ADrinkenburg, WHLavreysen, HHeitman, LHIJzerman, APTresadern, G Discovery and Kinetic Profiling of 7-Aryl-1,2,4-triazolo[4,3-a]pyridines: Positive Allosteric Modulators of the Metabotropic Glutamate Receptor 2. J Med Chem 60:6704-6720 (2017)  
Target
Name:
Metabotropic glutamate receptor 2
Synonyms:
GPRC1B GRM2_HUMAN Metabotropic glutamate receptor mGlu2 | metabotropic glutamate 2
Type:
Enzyme
Mol. Mass.:
95584.88
Organism:
Homo sapiens (Human)
Description:
Q14416
Residue:
872
  
Inhibitor
Name:
BDBM50257593
Synonyms:
CHEMBL4067421
Type:
Small organic molecule
Emp. Form.:
C20H20ClF3N4
Mol. Mass.:
408.848
SMILES:
CC(C)Nc1ccc(cc1Cl)-c1ccn2c(CC3CC3)nnc2c1C(F)(F)F
: