Target
Polycomb protein EED
Ligand
BDBM50259894
Substrate
Meas. Tech.
ChEMBL_1691990 (CHEMBL4042639)
IC50
1300±n/a nM
Citation
 Lingel, ASendzik, MHuang, YShultz, MDCantwell, JDillon, MPFu, XFuller, JGabriel, TGu, JJiang, XLi, LLiang, FMcKenna, MQi, WRao, WSheng, XShu, WSutton, JTaft, BWang, LZeng, JZhang, HZhang, MZhao, KLindvall, MBussiere, DE Structure-Guided Design of EED Binders Allosterically Inhibiting the Epigenetic Polycomb Repressive Complex 2 (PRC2) Methyltransferase. J Med Chem 60:415-427 (2017)  
Target
Name:
Polycomb protein EED
Synonyms:
EED WAIT-1 hEED
Type:
Protein
Mol. Mass.:
50201.68
Organism:
Homo sapiens (Human)
Description:
O75530
Residue:
441
  
Inhibitor
Name:
BDBM50259894
Synonyms:
CHEMBL4066475
Type:
Small organic molecule
Emp. Form.:
C15H17N3O2
Mol. Mass.:
271.3144
SMILES:
Nc1ncc2CCC(Cc3cccc4OCOc34)Cn12
: