Target
Polycomb protein EED
Ligand
BDBM50259893
Substrate
Meas. Tech.
ChEBML_1691994
IC50
2700±n/a nM
Citation
 Lingel, ASendzik, MHuang, YShultz, MDCantwell, JDillon, MPFu, XFuller, JGabriel, TGu, JJiang, XLi, LLiang, FMcKenna, MQi, WRao, WSheng, XShu, WSutton, JTaft, BWang, LZeng, JZhang, HZhang, MZhao, KLindvall, MBussiere, DE Structure-Guided Design of EED Binders Allosterically Inhibiting the Epigenetic Polycomb Repressive Complex 2 (PRC2) Methyltransferase. J Med Chem 60:415-427 (2017)  
Target
Name:
Polycomb protein EED
Synonyms:
EED WAIT-1 hEED
Type:
Protein
Mol. Mass.:
50201.68
Organism:
Homo sapiens (Human)
Description:
O75530
Residue:
441
  
Inhibitor
Name:
BDBM50259893
Synonyms:
CHEMBL4075055
Type:
Small organic molecule
Emp. Form.:
C16H17N3O
Mol. Mass.:
267.3257
SMILES:
Nc1ncc2CCC(Cc3cccc4occc34)Cn12
: