Target
Polycomb protein EED
Ligand
BDBM50259901
Substrate
Meas. Tech.
ChEBML_1691994
IC50
>500000±n/a nM
Citation
 Lingel, ASendzik, MHuang, YShultz, MDCantwell, JDillon, MPFu, XFuller, JGabriel, TGu, JJiang, XLi, LLiang, FMcKenna, MQi, WRao, WSheng, XShu, WSutton, JTaft, BWang, LZeng, JZhang, HZhang, MZhao, KLindvall, MBussiere, DE Structure-Guided Design of EED Binders Allosterically Inhibiting the Epigenetic Polycomb Repressive Complex 2 (PRC2) Methyltransferase. J Med Chem 60:415-427 (2017)  
Target
Name:
Polycomb protein EED
Synonyms:
EED WAIT-1 hEED
Type:
Protein
Mol. Mass.:
50201.68
Organism:
Homo sapiens (Human)
Description:
O75530
Residue:
441
  
Inhibitor
Name:
BDBM50259901
Synonyms:
CHEMBL1618229
Type:
Small organic molecule
Emp. Form.:
C12H17N
Mol. Mass.:
175.2701
SMILES:
C(C1CCCNC1)c1ccccc1
: