Target
Signal transduction protein TRAP
Ligand
BDBM50260006
Substrate
Meas. Tech.
ChEMBL_1692279 (CHEMBL4042928)
EC50
260±n/a nM
Citation
 Vermote, ABrackman, GRisseeuw, MDCappoen, DCos, PCoenye, TVan Calenbergh, S Novel Potentiators for Vancomycin in the Treatment of Biofilm-Related MRSA Infections via a Mix and Match Approach. ACS Med Chem Lett 8:38-42 (2017)  
Target
Name:
Signal transduction protein TRAP
Synonyms:
Signal transduction protein TRAP Target of RNAIII-activating protein | traP
Type:
PROTEIN
Mol. Mass.:
19547.99
Organism:
Staphylococcus aureus (strain Mu50 / ATCC 700699)
Description:
ChEMBL_117552
Residue:
167
  
Inhibitor
Name:
BDBM50260006
Synonyms:
CHEMBL4078565
Type:
Small organic molecule
Emp. Form.:
C21H19ClN2O6
Mol. Mass.:
430.838
SMILES:
O[C@@H]1[C@@H](CN2C(=O)c3ccccc3C2=O)OC[C@@]1(O)CNC(=O)c1ccccc1Cl
: