Target
Signal transduction protein TRAP
Ligand
BDBM50259998
Substrate
Meas. Tech.
ChEMBL_1692280 (CHEMBL4042929)
EC50
7980±n/a nM
Citation
 Vermote, ABrackman, GRisseeuw, MDCappoen, DCos, PCoenye, TVan Calenbergh, S Novel Potentiators for Vancomycin in the Treatment of Biofilm-Related MRSA Infections via a Mix and Match Approach. ACS Med Chem Lett 8:38-42 (2017)  
Target
Name:
Signal transduction protein TRAP
Synonyms:
Signal transduction protein TRAP Target of RNAIII-activating protein | traP
Type:
PROTEIN
Mol. Mass.:
19547.99
Organism:
Staphylococcus aureus (strain Mu50 / ATCC 700699)
Description:
ChEMBL_117552
Residue:
167
  
Inhibitor
Name:
BDBM50259998
Synonyms:
CHEMBL4077423
Type:
Small organic molecule
Emp. Form.:
C20H21ClN2O5
Mol. Mass.:
404.844
SMILES:
O[C@@H]1[C@@H](CNC(=O)c2ccccc2Cl)OC[C@@]1(O)CNC(=O)c1ccccc1
: