Target
Carbonic anhydrase 4
Ligand
BDBM26996
Substrate
Meas. Tech.
ChEBML_1692668
Ki
880±n/a nM
Citation
 Supuran, CT Bortezomib inhibits mammalian carbonic anhydrases. Bioorg Med Chem 25:5064-5067 (2017)  
Target
Name:
Carbonic anhydrase 4
Synonyms:
CA-IV CAH4_HUMAN Carbonic anhydrase Carbonic anhydrase IV (CA IV)
Type:
Enzyme
Mol. Mass.:
35037.98
Organism:
Homo sapiens (Human)
Description:
P22748
Residue:
312
  
Inhibitor
Name:
BDBM26996
Synonyms:
CHEMBL21485 Phenyl-boronic acid benzeneboronic acid phenylboronic acid
Type:
Emp. Form.:
C6H7BO2
Mol. Mass.:
121.93
SMILES:
OB(O)c1ccccc1
: