Target
Epidermal growth factor receptor
Ligand
BDBM50260360
Substrate
Meas. Tech.
ChEBML_1693612
IC50
166±n/a nM
Citation
 Gao, HYang, ZYang, XRao, Y Synthesis and evaluation of osimertinib derivatives as potent EGFR inhibitors. Bioorg Med Chem 25:4553-4559 (2017)  
Target
Name:
Epidermal growth factor receptor
Synonyms:
EGF Receptor Substrate EGFR_HUMAN ERBB1 Epidermal Growth Factor Receptor erbB-1 Epidermal growth factor receptor (EGFR) HER1 Proto-oncogene c-ErbB-1 Tyrosine-Protein Kinase ErbB-1
Type:
Receptor Kinase Domain
Mol. Mass.:
134279.59
Organism:
Homo sapiens (Human)
Description:
P00533
Residue:
1210
  
Inhibitor
Name:
BDBM50260360
Synonyms:
CHEMBL4103912
Type:
Small organic molecule
Emp. Form.:
C28H32FN7O2
Mol. Mass.:
517.5978
SMILES:
COc1cc(N(C)CCN(C)C)c(NC(=O)C=C)cc1Nc1nccc(n1)-c1cn(C)c2ccc(F)cc12
: