Target
5-hydroxytryptamine receptor 2C
Ligand
BDBM50260599
Substrate
Meas. Tech.
ChEBML_1694219
IC50
2.7±n/a nM
Citation
 Xiamuxi, HWang, ZLi, JWang, YWu, CYang, FJiang, XLiu, YZhao, QChen, WZhang, JXie, YHu, TXu, MGuo, SAkber Aisa, HHe, YShen, J Synthesis and biological investigation of tetrahydropyridopyrimidinone derivatives as potential multireceptor atypical antipsychotics. Bioorg Med Chem 25:4904-4916 (2017)  
Target
Name:
5-hydroxytryptamine receptor 2C
Synonyms:
5-HT-2C 5-HT2C-INI 5-HTR2C 5-hydroxytryptamine receptor 2C (5-HT-2C) 5HT-1C HTR1C Serotonin (5-HT3) receptor Serotonin Receptor 2C
Type:
G Protein-Coupled Receptor (GPCR)
Mol. Mass.:
51836.79
Organism:
Homo sapiens (Human)
Description:
P28335
Residue:
458
  
Inhibitor
Name:
BDBM50260599
Synonyms:
CHEMBL4094825
Type:
Small organic molecule
Emp. Form.:
C23H24N4OS
Mol. Mass.:
404.528
SMILES:
Cc1nc2ccccn2c(=O)c1CCN1CCN(CC1)c1cccc2sccc12
: