Target
Serine/threonine-protein kinase pim-1
Ligand
BDBM50262397
Substrate
Meas. Tech.
ChEBML_1696795
IC50
2500±n/a nM
Citation
 Barberis, CMoorcroft, NArendt, CLevit, MMoreno-Mazza, SBatchelor, JMechin, IMajid, T Discovery of N-substituted 7-azaindoles as PIM1 kinase inhibitors - Part I. Bioorg Med Chem Lett 27:4730-4734 (2017)  
Target
Name:
Serine/threonine-protein kinase pim-1
Synonyms:
PIM-1 Kinase PIM1_HUMAN Serine/threonine-protein kinase (PIM1) Serine/threonine-protein kinase PIM1 | Serine/threonine-protein kinase pim-1 (PIM1)
Type:
Protein
Mol. Mass.:
35681.82
Organism:
Homo sapiens (Human)
Description:
P11309
Residue:
313
  
Inhibitor
Name:
BDBM50262397
Synonyms:
CHEMBL4074103
Type:
Small organic molecule
Emp. Form.:
C18H17N5
Mol. Mass.:
303.3611
SMILES:
N#Cc1ccnc2[nH]c(cc12)-c1ccc(cc1)N1CCNCC1
: