Target
RAF proto-oncogene serine/threonine-protein kinase
Ligand
BDBM50396483
Substrate
Meas. Tech.
ChEMBL_1699093 (CHEMBL4050075)
IC50
135±n/a nM
Citation
 Wang, LZhang, QZhu, GZhang, ZZhi, YZhang, LMao, TZhou, XChen, YLu, TTang, W Design, synthesis and evaluation of derivatives based on pyrimidine scaffold as potent Pan-Raf inhibitors to overcome resistance. Eur J Med Chem 130:86-106 (2017)  
Target
Name:
RAF proto-oncogene serine/threonine-protein kinase
Synonyms:
C-Raf Protein Kinase RAF RAF1 Raf-1 Serine/threonine-protein kinase C-Raf | cRaf
Type:
Serine/threonine-protein kinase
Mol. Mass.:
73082.52
Organism:
Homo sapiens (Human)
Description:
P04049
Residue:
648
  
Inhibitor
Name:
BDBM50396483
Synonyms:
PLX-4032 Ro 5185426 US11332479, Compound Vemurafenib US9388165, Reference, Vemurafenib (PLX-4032) VEMURAFENIB
Type:
Small organic molecule
Emp. Form.:
C23H18ClF2N3O3S
Mol. Mass.:
489.922
SMILES:
CCCS(=O)(=O)Nc1ccc(F)c(C(=O)c2c[nH]c3ncc(cc23)-c2ccc(Cl)cc2)c1F
: