Target
Phosphatidylinositol 3-kinase regulatory subunit alpha/4,5-bisphosphate 3-kinase catalytic subunit delta isoform
Ligand
BDBM158769
Substrate
Meas. Tech.
ChEMBL_1701714 (CHEMBL4052947)
Ki
>1000±n/a nM
Citation
 Castanedo, GMBlaquiere, NBeresini, MBravo, BBrightbill, HChen, JCui, HFEigenbrot, CEverett, CFeng, JGodemann, RGogol, EHymowitz, SJohnson, AKayagaki, NKohli, PBKnüppel, KKraemer, JKrüger, SLoke, PMcEwan, PMontalbetti, CRoberts, DASmith, MSteinbacher, SSujatha-Bhaskar, STakahashi, RWang, XWu, LCZhang, YStaben, ST Structure-Based Design of Tricyclic NF-?B Inducing Kinase (NIK) Inhibitors That Have High Selectivity over Phosphoinositide-3-kinase (PI3K). J Med Chem 60:627-640 (2017)  
Target
Name:
Phosphatidylinositol 3-kinase regulatory subunit alpha/4,5-bisphosphate 3-kinase catalytic subunit delta isoform
Synonyms:
PI3-kinase p110-delta/p85-alpha PI3-kinase subunit p110 delta/p85 alpha PIK3CD/PIK3R1 p110delta/p85alpha
Type:
Heterodimer of a p110 (catalytic) and a p85 (regulatory) subunit
Mol. Mass.:
Description:
Recombinant human p110delta was coexpressed in an Sf9 baculovirus system with the p85alpha regulatory subunit and purified as GST-fusion protein using affinity chromatography on glutathione-sepharose.
Components:
This complex has 2 components.
Component 1
Name:
Phosphatidylinositol 4,5-bisphosphate 3-kinase catalytic subunit delta isoform
Synonyms:
PI3-kinase p110 subunit delta PI3-kinase subunit p110-delta PIK3CD Phosphatidylinositol 4,5-biphosphate 3-kinase catalytic subunit delta (PIK3CD) Phosphatidylinositol 4,5-bisphosphate 3-kinase 110 kDa catalytic subunit delta (PI3K delta) Phosphatidylinositol 4,5-bisphosphate 3-kinase catalytic subunit delta (PI3Kdelta) Phosphatidylinositol 4,5-bisphosphate 3-kinase catalytic subunit delta isoform (PI3K delta) Phosphatidylinositol 4,5-bisphosphate 3-kinase catalytic subunit delta isoform (PI3K-delta) Phosphatidylinositol 4,5-bisphosphate 3-kinase catalytic subunit delta isoform (PI3Kdelta)
Type:
Enzyme Subunit
Mol. Mass.:
119489.41
Organism:
Homo sapiens (Human)
Description:
O00329
Residue:
1044
  
Component 2
Name:
Phosphatidylinositol 3-kinase regulatory subunit alpha
Synonyms:
GRB1 PI3-kinase class I PI3-kinase p85-alpha subunit PI3-kinase subunit p85-alpha PIK3CG/PIK3R1 Phosphatidylinositol 3-kinase 85 kDa regulatory subunit alpha (PI3K alpha) Phosphatidylinositol 3-kinase regulatory subunit alpha (PIK3R1) Phosphatidylinositol 3-kinase regulatory subunit alpha isoform 1 (PI3 Kinase alpha) Phosphatidylinositol 4,5-bisphosphate 3-kinase catalytic subunit alpha isoform (PI3Kalpha) PtdIns-3-kinase p85-alpha p85 alpha
Type:
Protein
Mol. Mass.:
83592.82
Organism:
Homo sapiens (Human)
Description:
P27986
Residue:
724
  
Inhibitor
Name:
BDBM158769
Synonyms:
US9034866, 244
Type:
Small organic molecule
Emp. Form.:
C18H19N3O3
Mol. Mass.:
325.3618
SMILES:
C[C@H]1Cn2cc(nc2-c2cc(ccc2O1)C#CC(C)(C)O)C(N)=O
: