Target
Aromatase
Ligand
BDBM50011771
Substrate
Meas. Tech.
ChEBML_51027
Ki
1±n/a nM
Citation
 Childers, WESilverton, JVKellis, JTVickery, LERobinson, CH Inhibition of human placental aromatase by novel homologated 19-oxiranyl and 19-thiiranyl steroids. J Med Chem 34:1344-9 (1991)  
Target
Name:
Aromatase
Synonyms:
ARO1 CP19A_HUMAN CYP19 CYPXIX Cytochrome P450 19A1 Cytochrome P450-C19 (CYP19) FL cytokine receptor precursor | P-450AROM
Type:
Enzyme
Mol. Mass.:
57888.92
Organism:
Homo sapiens (Human)
Description:
P11511
Residue:
503
  
Inhibitor
Name:
BDBM50011771
Synonyms:
13-Methyl-10-thiiranyl-1,6,7,8,9,10,11,12,13,14,15,16-dodecahydro-2H-cyclopenta[a]phenanthrene-3,17-dione | CHEMBL281433
Type:
Small organic molecule
Emp. Form.:
C20H26O2S
Mol. Mass.:
330.484
SMILES:
C[C@]12CCC3C(CCC4=CC(=O)CC[C@@]34C3CS3)C1CCC2=O
: