Target
Vascular endothelial growth factor receptor 2
Ligand
BDBM50269388
Substrate
Meas. Tech.
ChEMBL_1706544 (CHEMBL4057777)
EC50
104±n/a nM
Citation
 Goff, DZhang, JHeckrodt, TYu, JDing, PSingh, RHolland, SLi, WIrving, M Discovery of dual Axl/VEGF-R2 inhibitors as potential anti-angiogenic and anti-metastatic drugs for cancer chemotherapy. Bioorg Med Chem Lett 27:3766-3771 (2017)  
Target
Name:
Vascular endothelial growth factor receptor 2
Synonyms:
CD_antigen=CD309 Fetal liver kinase 1 (FLK-1) KDR Protein-tyrosine kinase receptor Flk-1 VEGFR-2 VEGFR2 Vascular Endothelial Growth Factor Receptor Kinase 2 Vascular endothelial growth factor receptor 2 (KDR) Vascular endothelial growth factor receptor 2 (VEGFR2) Vascular endothelial growth factor receptor-2 (VEGFR-2)
Type:
Receptor Tyrosine Kinase
Mol. Mass.:
151510.97
Organism:
Homo sapiens (Human)
Description:
P35968
Residue:
1356
  
Inhibitor
Name:
BDBM50269388
Synonyms:
CHEMBL4083641
Type:
Small organic molecule
Emp. Form.:
C28H33N9
Mol. Mass.:
495.6219
SMILES:
Cc1nc(-n2nc(Nc3ccc(cc3)N3CCN(CC3)C3CC4CCC3C4)nc2N)c2ccccc2n1
: