Target
Vascular endothelial growth factor receptor 2
Ligand
BDBM313137
Substrate
Meas. Tech.
ChEMBL_1706544 (CHEMBL4057777)
EC50
14±n/a nM
Citation
 Goff, DZhang, JHeckrodt, TYu, JDing, PSingh, RHolland, SLi, WIrving, M Discovery of dual Axl/VEGF-R2 inhibitors as potential anti-angiogenic and anti-metastatic drugs for cancer chemotherapy. Bioorg Med Chem Lett 27:3766-3771 (2017)  
Target
Name:
Vascular endothelial growth factor receptor 2
Synonyms:
CD_antigen=CD309 Fetal liver kinase 1 (FLK-1) KDR Protein-tyrosine kinase receptor Flk-1 VEGFR-2 VEGFR2 Vascular Endothelial Growth Factor Receptor Kinase 2 Vascular endothelial growth factor receptor 2 (KDR) Vascular endothelial growth factor receptor 2 (VEGFR2) Vascular endothelial growth factor receptor-2 (VEGFR-2)
Type:
Receptor Tyrosine Kinase
Mol. Mass.:
151510.97
Organism:
Homo sapiens (Human)
Description:
P35968
Residue:
1356
  
Inhibitor
Name:
BDBM313137
Synonyms:
1-(6,7-dimethoxyquinazolin-4-yl)-N3-(4-(1-methylpiperidin-4-yl)phenyl)-1H-1,2,4-triazole-3,5-diamine | US10166216, Compound 168
Type:
Small organic molecule
Emp. Form.:
C24H28N8O2
Mol. Mass.:
460.5315
SMILES:
COc1cc2ncnc(-n3nc(Nc4ccc(cc4)C4CCN(C)CC4)nc3N)c2cc1OC
: