Target
Vascular endothelial growth factor receptor 2
Ligand
BDBM50269390
Substrate
Meas. Tech.
ChEMBL_1706544 (CHEMBL4057777)
EC50
26±n/a nM
Citation
 Goff, DZhang, JHeckrodt, TYu, JDing, PSingh, RHolland, SLi, WIrving, M Discovery of dual Axl/VEGF-R2 inhibitors as potential anti-angiogenic and anti-metastatic drugs for cancer chemotherapy. Bioorg Med Chem Lett 27:3766-3771 (2017)  
Target
Name:
Vascular endothelial growth factor receptor 2
Synonyms:
CD_antigen=CD309 Fetal liver kinase 1 (FLK-1) KDR Protein-tyrosine kinase receptor Flk-1 VEGFR-2 VEGFR2 Vascular Endothelial Growth Factor Receptor Kinase 2 Vascular endothelial growth factor receptor 2 (KDR) Vascular endothelial growth factor receptor 2 (VEGFR2) Vascular endothelial growth factor receptor-2 (VEGFR-2)
Type:
Receptor Tyrosine Kinase
Mol. Mass.:
151510.97
Organism:
Homo sapiens (Human)
Description:
P35968
Residue:
1356
  
Inhibitor
Name:
BDBM50269390
Synonyms:
CHEMBL4080190
Type:
Small organic molecule
Emp. Form.:
C28H34FN9O2
Mol. Mass.:
547.6271
SMILES:
COc1cc2ncnc(-n3nc(Nc4ccc(N5CCN(CC5)C5CCCCC5)c(F)c4)nc3N)c2cc1OC
: